Reaction Details
TargetTyrosine-protein phosphatase non-receptor type 22
LigandBDBM35730
Substrate/Competitorn/a
IC50 56100±n/a nM
Citation PubChem, PC Dose response confirmation of small molecule inhibitors of Low Molecular Weight Protein Tyrosine Phosphatase, LMPTP, in a fluorescence-based, Lymphoid Phosphatase (PTPN22, LYP-1) selectivity Assay PubChem Bioassay(2013)[AID]
 
Tyrosine-protein phosphatase non-receptor type 22
Name:Tyrosine-protein phosphatase non-receptor type 22
Type:n/a
Mol. Mass.:91712.31
Organism:Homo sapiens (Human)
Description:Q9Y2R2
Residue:807
BDBM35730
NameBDBM35730
Synonyms:cid_694792 | sulfonamide deriv., 5e
TypeSmall organic molecule
Emp. Form.C13H14N2O3S2
Mol. Mass.310.392
SMILESNS(=O)(=O)c1ccc(CNC(=O)Cc2cccs2)cc1