Reaction Details
TargetRecBCD enzyme subunit RecD
LigandBDBM33687
Substrate/Competitorn/a
IC50>39522±n/a nM
Citation PubChem, PC Absorbance-based bacterial cell-based high throughput dose response assay to identify inhibitors of RecBCD PubChem Bioassay(2013)[AID]
 
RecBCD enzyme subunit RecD
Name:RecBCD enzyme subunit RecD
Type:Enzyme Catalytic Domain
Mol. Mass.:66906.68
Organism:Escherichia coli str. K-12 substr. MG1655
Description:gi_16130723
Residue:608
BDBM33687
NameBDBM33687
Synonyms:5-nitro-N-(4-methyl-2-pyridinyl)-2-furamide N-(4-methyl-2-pyridinyl)-5-nitro-2-furancarboxamide N-(4-methylpyridin-2-yl)-5-nitro-furan-2-carboxamide SMR000163693 | cid_844040
TypeSmall organic molecule
Emp. Form.C11H9N3O4
Mol. Mass.247.2069
SMILESCc1ccnc(NC(=O)c2ccc(o2)[N+]([O-])=O)c1