Reaction Details
TargetRecBCD enzyme subunit RecD
LigandBDBM93674
Substrate/Competitorn/a
IC50>39529±n/a nM
Citation PubChem, PC Absorbance-based bacterial cell-based high throughput dose response assay to identify inhibitors of RecBCD PubChem Bioassay(2013)[AID]
 
RecBCD enzyme subunit RecD
Name:RecBCD enzyme subunit RecD
Type:Enzyme Catalytic Domain
Mol. Mass.:66906.68
Organism:Escherichia coli str. K-12 substr. MG1655
Description:gi_16130723
Residue:608
BDBM93674
NameBDBM93674
Synonyms:(E)-(2-methylbenzimidazol-1-yl)-[(5-nitro-2-furyl)methylene]amine (E)-N-(2-methylbenzimidazol-1-yl)-1-(5-nitrofuran-2-yl)methanimine MLS000578078 cid_9563275
TypeSmall organic molecule
Emp. Form.C13H10N4O3
Mol. Mass.270.2435
SMILESCc1nc2ccccc2n1\N=C\c1ccc(o1)[N+]([O-])=O