Reaction Details
TargetRecBCD enzyme subunit RecD
LigandBDBM34905
Substrate/Competitorn/a
IC50>118477±n/a nM
Citation PubChem, PC Absorbance-based bacterial cell-based high throughput dose response assay to identify inhibitors of RecBCD PubChem Bioassay(2013)[AID]
 
RecBCD enzyme subunit RecD
Name:RecBCD enzyme subunit RecD
Type:Enzyme Catalytic Domain
Mol. Mass.:66906.68
Organism:Escherichia coli str. K-12 substr. MG1655
Description:gi_16130723
Residue:608
BDBM34905
NameBDBM34905
Synonyms:1,6-dimethyl-3-propyl-pyrimido[5,4-e][1,2,4]triazine-5,7-dione 1,6-dimethyl-3-propylpyrimido[5,4-e][1,2,4]triazine-5,7-dione SMR000291200 cid_3164059
TypeSmall organic molecule
Emp. Form.C10H13N5O2
Mol. Mass.235.2425
SMILESCCCc1nn(C)c2nc(=O)n(C)c(=O)c2n1