Reaction Details
TargetRecBCD enzyme subunit RecD
LigandBDBM96258
Substrate/Competitorn/a
IC50 20684±n/a nM
Citation PubChem, PC Absorbance-based bacterial cell-based high throughput dose response assay to identify inhibitors of RecBCD PubChem Bioassay(2013)[AID]
 
RecBCD enzyme subunit RecD
Name:RecBCD enzyme subunit RecD
Type:Enzyme Catalytic Domain
Mol. Mass.:66906.68
Organism:Escherichia coli str. K-12 substr. MG1655
Description:gi_16130723
Residue:608
BDBM96258
NameBDBM96258
Synonyms:MLS001005783 N-[(E)-(5-nitro-2-furyl)methyleneamino]cyclopropanecarboxamide SMR000384071 | cid_6901830
TypeSmall organic molecule
Emp. Form.C9H9N3O4
Mol. Mass.223.1855
SMILES[O-][N+](=O)c1ccc(\C=N\NC(=O)C2CC2)o1