Reaction Details
TargetRecBCD enzyme subunit RecD
LigandBDBM96269
Substrate/Competitorn/a
IC50 18643±n/a nM
Citation PubChem, PC Absorbance-based bacterial cell-based high throughput dose response assay to identify inhibitors of RecBCD PubChem Bioassay(2013)[AID]
 
RecBCD enzyme subunit RecD
Name:RecBCD enzyme subunit RecD
Type:Enzyme Catalytic Domain
Mol. Mass.:66906.68
Organism:Escherichia coli str. K-12 substr. MG1655
Description:gi_16130723
Residue:608
BDBM96269
NameBDBM96269
Synonyms:5-Nitro-furan-2-carboxylic acid pyridin-3-ylamide 5-nitro-N-(3-pyridyl)-2-furamide 5-nitro-N-pyridin-3-ylfuran-2-carboxamide SMR000515217 | cid_148471
TypeSmall organic molecule
Emp. Form.C10H7N3O4
Mol. Mass.233.1803
SMILES[O-][N+](=O)c1ccc(o1)C(=O)Nc1cccnc1