Reaction Details
TargetRecBCD enzyme subunit RecD
LigandBDBM60193
Substrate/Competitorn/a
IC50 30077±n/a nM
Citation PubChem, PC Absorbance-based bacterial cell-based high throughput dose response assay to identify inhibitors of RecBCD PubChem Bioassay(2013)[AID]
 
RecBCD enzyme subunit RecD
Name:RecBCD enzyme subunit RecD
Type:Enzyme Catalytic Domain
Mol. Mass.:66906.68
Organism:Escherichia coli str. K-12 substr. MG1655
Description:gi_16130723
Residue:608
BDBM60193
NameBDBM60193
Synonyms:(2Z)-2-[[1-(4-methoxyphenyl)-2,6-dimethyl-4-pyridin-1-iumyl]methylidene]-3-methyl-1,3-benzothiazole;iodide (2Z)-2-[[1-(4-methoxyphenyl)-2,6-dimethyl-pyridin-1-ium-4-yl]methylidene]-3-methyl-1,3-benzothiazole;iodide MLS001011153 cid_16196223
TypeSmall organic molecule
Emp. Form.C23H23N2OS
Mol. Mass.375.506
SMILESCOc1ccc(cc1)-[n+]1c(C)cc(\C=C2/Sc3ccccc3N2C)cc1C