Reaction Details
TargetT cell receptor alpha variable 4
LigandBDBM51295
Substrate/Competitorn/a
IC50 3736±n/a nM
Citation PubChem, PC Fluorescence-based biochemical primary high throughput dose response assay to identify inhibitors of T-cell receptor (TCR)-CD3 interaction using a TAMRA-labeled TCR probe PubChem Bioassay(2013)[AID]
 
T cell receptor alpha variable 4
Name:T cell receptor alpha variable 4
Type:Enzyme Catalytic Domain
Mol. Mass.:12216.28
Organism:Homo sapiens (Human)
Description:A0A0B4J268
Residue:109
BDBM51295
NameBDBM51295
Synonyms:8-Amino-2-thioxo-2,3-dihydro-1H-benzo[g]pteridin-4-one 8-amino-2-thioxo-1H-benzo[g]pteridin-4-one MLS000776691 cid_5417965
TypeSmall organic molecule
Emp. Form.C10H7N5OS
Mol. Mass.245.26
SMILESNc1ccc2nc3c(nc2c1)[nH]c(=S)[nH]c3=O