Reaction Details
TargetAlbumin
LigandBDBM46189
Substrate/Competitorn/a
IC50>94106±n/a nM
Citation PubChem, PC Counterscreen for inhibitors of T-cell receptor (TCR)-CD3 interaction: Fluorescence-based biochemical high throughput dose response assay to identify inhibitors of T-cell receptor (TCR)-CD3 interaction using a TAMRA-labeled BSA probe PubChem Bioassay(2013)[AID]
 
Albumin
Name:Albumin
Type:PROTEIN
Mol. Mass.:69288.15
Organism:Bos taurus
Description:ChEMBL_1502598
Residue:607
BDBM46189
NameBDBM46189
Synonyms:1-[2,3-bis(2-furanyl)-6-quinoxalinyl]-3-(2-methoxyethyl)urea 1-[2,3-bis(furan-2-yl)quinoxalin-6-yl]-3-(2-methoxyethyl)urea cid_3157647
TypeSmall organic molecule
Emp. Form.C20H18N4O4
Mol. Mass.378.3813
SMILESCOCCNC(=O)Nc1ccc2nc(-c3ccco3)c(nc2c1)-c1ccco1