Reaction Details
TargetAlbumin
LigandBDBM50056891
Substrate/Competitorn/a
IC50>93941±n/a nM
Citation PubChem, PC Counterscreen for inhibitors of T-cell receptor (TCR)-CD3 interaction: Fluorescence-based biochemical high throughput dose response assay to identify inhibitors of T-cell receptor (TCR)-CD3 interaction using a TAMRA-labeled BSA probe PubChem Bioassay(2013)[AID]
 
Albumin
Name:Albumin
Type:PROTEIN
Mol. Mass.:69288.15
Organism:Bos taurus
Description:ChEMBL_1502598
Residue:607
BDBM50056891
NameBDBM50056891
Synonyms:2-Hydroxy-benzoic acid N'-(2-hydroxy-benzoyl)-hydrazide CHEMBL36303 | cid_65303
TypeSmall organic molecule
Emp. Form.C14H12N2O4
Mol. Mass.272.2561
SMILESOc1ccccc1C(=O)NNC(=O)c1ccccc1O