Reaction Details
TargetHuntingtin
LigandBDBM96446
Substrate/Competitorn/a
IC50 1121±n/a nM
Citation PubChem, PC Fluorescence-based biochemical high throughput dose response assay to identify molecules that bind r(CAG) RNA repeats PubChem Bioassay(2013)[AID]
 
Huntingtin
Name:Huntingtin
Type:PROTEIN
Mol. Mass.:347579.69
Organism:Homo sapiens (Human)
Description:EBI_101216
Residue:3142
BDBM96446
NameBDBM96446
Synonyms:MLS000391903 cid_2318621
TypeSmall organic molecule
Emp. Form.C18H14N6O3
Mol. Mass.362.3422
SMILESOCCCNc1ncc2c(n1)c(=O)c(C#N)c1[nH]c3ccccc3c(=O)n21