Reaction Details
TargetHuntingtin
LigandBDBM53935
Substrate/Competitorn/a
IC50 879.24±n/a nM
Citation PubChem, PC Fluorescence-based biochemical high throughput dose response assay to identify molecules that bind r(CAG) RNA repeats PubChem Bioassay(2013)[AID]
 
Huntingtin
Name:Huntingtin
Type:PROTEIN
Mol. Mass.:347579.69
Organism:Homo sapiens (Human)
Description:EBI_101216
Residue:3142
BDBM53935
NameBDBM53935
Synonyms:4-methyl-N-[(5Z)-4-oxidanylidene-5-(phenylmethylidene)-1,3-thiazol-2-yl]benzenesulfonamide MLS000676644 N-[(5Z)-5-benzal-4-keto-2-thiazolin-2-yl]-4-methyl-benzenesulfonamide SMR000298295 | cid_1911572
TypeSmall organic molecule
Emp. Form.C17H14N2O3S2
Mol. Mass.358.435
SMILESCc1ccc(cc1)S(=O)(=O)NC1=NC(=O)\C(S1)=C\c1ccccc1