Reaction Details
TargetHuntingtin
LigandBDBM96461
Substrate/Competitorn/a
IC50 1595±n/a nM
Citation PubChem, PC Fluorescence-based biochemical high throughput dose response assay to identify molecules that bind r(CAG) RNA repeats PubChem Bioassay(2013)[AID]
 
Huntingtin
Name:Huntingtin
Type:PROTEIN
Mol. Mass.:347579.69
Organism:Homo sapiens (Human)
Description:EBI_101216
Residue:3142
BDBM96461
NameBDBM96461
Synonyms:3-methyl-1-(3-methylphenyl)-6-thiophen-2-yl-4-pyrazolo[3,4-b]pyridinecarboxylic acid 3-methyl-1-(3-methylphenyl)-6-thiophen-2-ylpyrazolo[3,4-b]pyridine-4-carboxylic acid MLS000761489 cid_4542341
TypeSmall organic molecule
Emp. Form.C19H15N3O2S
Mol. Mass.349.406
SMILESCc1nn(-c2cccc(C)c2)c2nc(cc(C(O)=O)c12)-c1cccs1