Reaction Details
TargetHuntingtin
LigandBDBM96471
Substrate/Competitorn/a
IC50 560.72±n/a nM
Citation PubChem, PC Fluorescence-based biochemical high throughput dose response assay to identify molecules that bind r(CAG) RNA repeats PubChem Bioassay(2013)[AID]
 
Huntingtin
Name:Huntingtin
Type:PROTEIN
Mol. Mass.:347579.69
Organism:Homo sapiens (Human)
Description:EBI_101216
Residue:3142
BDBM96471
NameBDBM96471
Synonyms:3-[(2E)-2-(1-cyano-2-oxo-2-phenylethylidene)hydrazinyl]-5-(methylthio)-4-propan-2-ylsulfonyl-2-thiophenecarboxylic acid methyl ester MLS000859225 cid_6375278 methyl 3-[(2E)-2-(1-cyano-2-oxo-2-phenylethylidene)hydrazinyl]-5-methylsulfanyl-4-propan-2-ylsulfonylthiophene-2-carboxylate | methyl 3-[2-(1-cyano-2-oxo-2-phenylethylidene)hydrazino]-4-(isopropylsulfonyl)-5-(methylthio)thiophene-2-carboxylate
TypeSmall organic molecule
Emp. Form.C19H19N3O5S3
Mol. Mass.465.566
SMILESCOC(=O)c1sc(SC)c(c1NN=C(C#N)C(=O)c1ccccc1)S(=O)(=O)C(C)C