Reaction Details
TargetHuntingtin
LigandBDBM96472
Substrate/Competitorn/a
IC50 1521±n/a nM
Citation PubChem, PC Fluorescence-based biochemical high throughput dose response assay to identify molecules that bind r(CAG) RNA repeats PubChem Bioassay(2013)[AID]
 
Huntingtin
Name:Huntingtin
Type:PROTEIN
Mol. Mass.:347579.69
Organism:Homo sapiens (Human)
Description:EBI_101216
Residue:3142
BDBM96472
NameBDBM96472
Synonyms:1-(phenylmethyl)-3-[6-[2,4,6-trioxo-3-(phenylmethyl)-1,3-diazinan-1-yl]hexyl]-1,3-diazinane-2,4,6-trione 1-benzyl-3-[6-(3-benzyl-2,4,6-triketo-hexahydropyrimidin-1-yl)hexyl]barbituric acid 1-benzyl-3-{6-[3-benzyl-2,4,6-trioxotetrahydropyrimidin-1(2H)-yl]hexyl}pyrimidine-2,4,6(1H,3H,5H)-trione SMR000459203 | cid_2818390
TypeSmall organic molecule
Emp. Form.C28H30N4O6
Mol. Mass.518.561
SMILESO=C1CC(=O)N(Cc2ccccc2)C(=O)N1CCCCCCN1C(=O)CC(=O)N(Cc2ccccc2)C1=O