Reaction Details
TargetHuntingtin
LigandBDBM96507
Substrate/Competitorn/a
IC50 1476±n/a nM
Citation PubChem, PC Fluorescence-based biochemical high throughput dose response assay to identify molecules that bind r(CAG) RNA repeats PubChem Bioassay(2013)[AID]
 
Huntingtin
Name:Huntingtin
Type:PROTEIN
Mol. Mass.:347579.69
Organism:Homo sapiens (Human)
Description:EBI_101216
Residue:3142
BDBM96507
NameBDBM96507
Synonyms:4,5-dimethoxy-2-[({4-[(methylanilino)sulfonyl]-2-thienyl}carbonyl)amino]benzoic acid 4,5-dimethoxy-2-[[4-[methyl(phenyl)sulfamoyl]thiophene-2-carbonyl]amino]benzoic acid MLS001147241 cid_1819958
TypeSmall organic molecule
Emp. Form.C21H20N2O7S2
Mol. Mass.476.523
SMILESCOc1cc(NC(=O)c2cc(cs2)S(=O)(=O)N(C)c2ccccc2)c(cc1OC)C(O)=O