Reaction Details
TargetHuntingtin
LigandBDBM46036
Substrate/Competitorn/a
IC50 1097±n/a nM
Citation PubChem, PC Fluorescence-based biochemical high throughput dose response assay to identify molecules that bind r(CAG) RNA repeats PubChem Bioassay(2013)[AID]
 
Huntingtin
Name:Huntingtin
Type:PROTEIN
Mol. Mass.:347579.69
Organism:Homo sapiens (Human)
Description:EBI_101216
Residue:3142
BDBM46036
NameBDBM46036
Synonyms:2-[[3-(3-keto-1,2-benzothiazol-2-yl)phenyl]sulfonylamino]benzoic acid 2-[[3-(3-oxo-1,2-benzothiazol-2-yl)phenyl]sulfonylamino]benzoic acid cid_4089709
TypeSmall organic molecule
Emp. Form.C20H14N2O5S2
Mol. Mass.426.466
SMILESOC(=O)c1ccccc1NS(=O)(=O)c1cccc(c1)-n1sc2ccccc2c1=O