Reaction Details
TargetCyclic AMP receptor protein
LigandBDBM10851
Substrate/Competitorn/a
IC50 129690±n/a nM
Citation PubChem, PC Vibrio cholerae assay for pro-quorum sensing small molecules PubChem Bioassay(2013)[AID]
 
Cyclic AMP receptor protein
Name:Cyclic AMP receptor protein
Synonyms:n/a
Type:Enzyme Catalytic Domain
Mol. Mass.:23640.23
Organism:Vibrio cholerae O1 biovar El Tor str. N16961
Description:Q9KNW6
Residue:210
BDBM10851
NameBDBM10851
TypeSmall organic molecule
Emp. Form.C10H12N5O6P
Mol. Mass.329.2059
SMILESNc1ncnc2n(cnc12)[C@@H]1O[C@@H]2COP(O)(=O)O[C@H]2[C@H]1O