Reaction Details
TargetGuanine nucleotide-binding protein subunit alpha-15
LigandBDBM96613
Substrate/Competitorn/a
EC50>29905±n/a nM
Citation PubChem, PC Counterscreen for agonists of the human trace amine associated receptor 1 (TAAR1): Fluorescence-based cell-based high throughput dose response assay to identify nonselective Ga16 agonists PubChem Bioassay(2013)[AID]
 
Guanine nucleotide-binding protein subunit alpha-15
Name:Guanine nucleotide-binding protein subunit alpha-15
Type:Protein
Mol. Mass.:43577.62
Organism:Homo sapiens (Human)
Description:P30679
Residue:374
BDBM96613
NameBDBM96613
Synonyms:2-[(4-keto-6-methyl-1H-pyrimidin-2-yl)thio]-N-phenethyl-acetamide 2-[(6-methyl-4-oxidanylidene-1H-pyrimidin-2-yl)sulfanyl]-N-(2-phenylethyl)ethanamide 2-[(6-methyl-4-oxo-1H-pyrimidin-2-yl)thio]-N-(2-phenylethyl)acetamide MLS000531589 cid_892234
TypeSmall organic molecule
Emp. Form.C15H17N3O2S
Mol. Mass.303.379
SMILESCc1cc(=O)[nH]c(SCC(=O)NCCc2ccccc2)n1