Reaction Details
TargetNuclear receptor subfamily 0 group B member 1
LigandBDBM84342
Substrate/Competitorn/a
IC50>67574±n/a nM
Citation PubChem, PC Luminescence-based cell-based high throughput dose response assay for inhibitors of the orphan nuclear receptor subfamily 0, group B, member 1 (DAX1; NR0B1): repression of SF-1 (NR5A1) activated StAR promoter by full-length DAX-1 PubChem Bioassay(2013)[AID]
 
Nuclear receptor subfamily 0 group B member 1
Name:Nuclear receptor subfamily 0 group B member 1
Type:Enzyme Catalytic Domain
Mol. Mass.:51729.22
Organism:Homo sapiens (Human)
Description:gi_5016090
Residue:470
BDBM84342
NameBDBM84342
Synonyms:4-[1-hydroxy-2-(methylamino)ethyl]benzene-1,2-diol 4-[1-hydroxy-2-(methylamino)ethyl]benzene-1,2-diol;hydrochloride 4-[2-(methylamino)-1-oxidanyl-ethyl]benzene-1,2-diol;hydrochloride EPINEPHRINE MLS001333244 cid_5924
TypeSmall organic molecule
Emp. Form.C9H13NO3
Mol. Mass.183.2044
SMILESCNCC(O)c1ccc(O)c(O)c1