Reaction Details
TargetFarnesyl pyrophosphate synthase
LigandBDBM97430
Substrate/Competitorn/a
Meas. Tech.Inhibition Assay
pH7.4±0
Temperature298.15±0 K
IC50 1.8e+3±n/a nM
Citation Lindert, SZhu, WLiu, YLPang, ROldfield, EMcCammon, JA Farnesyl diphosphate synthase inhibitors from in silico screening. Chem Biol Drug Des81:742-8 (2013) 
 
Farnesyl pyrophosphate synthase
Name:Farnesyl pyrophosphate synthase
Type:Enzyme
Mol. Mass.:48272.89
Organism:Homo sapiens (Human)
Description:P14324
Residue:419
BDBM97430
NameBDBM97430
Synonyms:50460, 14 | BPH-1358
TypeSmall molecule
Emp. Form.C32H28N6O2
Mol. Mass.528.6037
SMILESO=C(Nc1cccc(c1)C1=NCCN1)c1ccc(cc1)-c1ccc(cc1)C(=O)Nc1cccc(c1)C1=NCCN1