Reaction Details
TargetEnoyl-[acyl-carrier-protein] reductase [NADPH] FabI
LigandBDBM16298
Substrate/Competitorn/a
Meas. Tech.Thermal Shift Assay
pH7.5±0
Ki 0.82±0 nM
Citation Chang, ASchiebel, JYu, WBommineni, GRPan, PBaxter, MVKhanna, ASotriffer, CAKisker, CTonge, PJ Rational Optimization of Drug-Target Residence Time: Insights from Inhibitor Binding to the Staphylococcus aureus FabI Enzyme-Product Complex. Biochemistry52:4217-28 (2013) 
 
Enoyl-[acyl-carrier-protein] reductase [NADPH] FabI
Name:Enoyl-[acyl-carrier-protein] reductase [NADPH] FabI
Type:Enzyme
Mol. Mass.:27989.00
Organism:Staphylococcus aureus
Description:Q6GI75
Residue:256
BDBM16298
NameBDBM16298
Synonyms:5-Octyl-2-phenoxy-phenol 5-octyl-2-phenoxyphenol AIDS227448 PT05
TypeSmall organic molecule
Emp. Form.C20H26O2
Mol. Mass.298.4192
SMILESCCCCCCCCc1ccc(Oc2ccccc2)c(O)c1