Reaction Details
TargetEnoyl-[acyl-carrier-protein] reductase [NADPH] FabI
LigandBDBM97440
Substrate/Competitorn/a
Meas. Tech.Thermal Shift Assay
pH7.5±0
Ki 0.11±0.01 nM
Citation Chang, ASchiebel, JYu, WBommineni, GRPan, PBaxter, MVKhanna, ASotriffer, CAKisker, CTonge, PJ Rational Optimization of Drug-Target Residence Time: Insights from Inhibitor Binding to the Staphylococcus aureus FabI Enzyme-Product Complex. Biochemistry52:4217-28 (2013) 
 
Enoyl-[acyl-carrier-protein] reductase [NADPH] FabI
Name:Enoyl-[acyl-carrier-protein] reductase [NADPH] FabI
Type:Enzyme
Mol. Mass.:27989.00
Organism:Staphylococcus aureus
Description:Q6GI75
Residue:256
BDBM97440
NameBDBM97440
Synonyms:PT68
TypeSmall molecule
Emp. Form.C15H14O2
Mol. Mass.226.2705
SMILESOc1cc(CC=C)ccc1Oc1ccccc1