Reaction Details
TargetEnoyl-[acyl-carrier-protein] reductase [NADPH] FabI
LigandBDBM50373348
Substrate/Competitorn/a
Meas. Tech.Thermal Shift Assay
pH7.5±0
Ki 0.12±0 nM
Citation Chang, ASchiebel, JYu, WBommineni, GRPan, PBaxter, MVKhanna, ASotriffer, CAKisker, CTonge, PJ Rational Optimization of Drug-Target Residence Time: Insights from Inhibitor Binding to the Staphylococcus aureus FabI Enzyme-Product Complex. Biochemistry52:4217-28 (2013) 
 
Enoyl-[acyl-carrier-protein] reductase [NADPH] FabI
Name:Enoyl-[acyl-carrier-protein] reductase [NADPH] FabI
Type:Enzyme
Mol. Mass.:27989.00
Organism:Staphylococcus aureus
Description:Q6GI75
Residue:256
BDBM50373348
NameBDBM50373348
Synonyms:CHEMBL264434 | PT13
TypeSmall organic molecule
Emp. Form.C18H23NO2
Mol. Mass.285.3807
SMILESCCCCCCc1ccc(Oc2ccccc2N)c(O)c1