Reaction Details
TargetAcetyl-CoA carboxylase 2 [151-2458]
LigandBDBM97615
Substrate/Competitorn/a
Meas. Tech.Luminometric Assay
pH7.5±0
Temperature310.15±0 K
IC50 9e+1±n/a nM
Citation Zoller, GSchmoll, DMueller, MHaschke, GFocken, I Heterocyclic compounds, processes for their preparation, medicaments comprising these compounds, and the use thereof US Patent US8470841 Publication Date 6/25/2013
 
Acetyl-CoA carboxylase 2 [151-2458]
Name:Acetyl-CoA carboxylase 2 [151-2458]
Type:Protein
Mol. Mass.:260677.17
Organism:Homo sapiens (Human)
Description:O00763 aa 1-150 removed
Residue:2308
BDBM97615
NameBDBM97615
Synonyms:US8470841, 44
TypeSmall organic molecule
Emp. Form.C22H28N2O3
Mol. Mass.368.4693
SMILESCC(C)Oc1ccc(Oc2ccc(CCC(C)NC(=O)C3CC3)cc2)cn1