Reaction Details
TargetIsocitrate dehydrogenase [NADP] cytoplasmic [R132C]
LigandBDBM279981
Substrate/Competitorn/a
Meas. Tech.In Vitro Assays for IDH1m (R132H or R132C) Inhibitors
pH6.5±n/a
Temperature298.15±n/a K
IC50<50±n/a nM
Commentsextracted
Citation Konteatis, ZDPopovici-Muller, JTravins, JMZahler, RCai, ZZhou, D Therapeutically active compounds and their methods of use US Patent US10028961 Publication Date 7/24/2018
 
Isocitrate dehydrogenase [NADP] cytoplasmic [R132C]
Name:Isocitrate dehydrogenase [NADP] cytoplasmic [R132C]
Type:Enzyme Catalytic Domain
Mol. Mass.:46607.23
Organism:Homo sapiens (Human)
Description:O75874[R132C]
Residue:414
BDBM279981
NameBDBM279981
Synonyms:US10028961, Compound 134 US10946023, Compound 134
TypeSmall organic molecule
Emp. Form.C20H16ClF3N8
Mol. Mass.460.843
SMILESCC(Nc1nc(Nc2ccnc(c2)C2(CC2)C#N)nc(n1)-c1cccc(Cl)n1)C(F)(F)F