Reaction Details
TargetRho-associated protein kinase 1 [17-535]
LigandBDBM97666
Substrate/Competitorn/a
Meas. Tech.Inhibition Assay
pH7.2±0
Ki 35±0.0 nM
Citation Lampe, JWWatson, PSSlade, DJ Bridged bicyclic RHO kinase inhibitor compounds, composition and use US Patent US8476295 Publication Date 7/2/2013
 
Rho-associated protein kinase 1 [17-535]
Name:Rho-associated protein kinase 1 [17-535]
Type:Protien
Mol. Mass.:60345.48
Organism:Homo Sapiens (Human)
Description:aa 17-535
Residue:519
BDBM97666
NameBDBM97666
Synonyms:US8476295, 1.1.04
TypeSmall organic molecule
Emp. Form.C24H30N4O2
Mol. Mass.406.5206
SMILESCc1ccc(CN2C3CCC2CC(C3)Nc2ccc3[nH]ncc3c2)cc1OCCO