Reaction Details
TargetMacrophage colony-stimulating factor 1
LigandBDBM97735
Substrate/Competitorn/a
Meas. Tech.Fluorescence Polarization Competition Immunoassay
pH7.5±0
IC50 3±n/a nM
Citation Illig, CRBallentine, SKChen, JDesJarlais, RLMeegalla, SKWall, MWilson, K Inhibitors of c-fms kinase US Patent US8481564 Publication Date 7/9/2013
 
Macrophage colony-stimulating factor 1
Name:Macrophage colony-stimulating factor 1
Type:Protein
Mol. Mass.:60631.84
Organism:Mus musculus (Mouse)
Description:P07141
Residue:552
BDBM97735
NameBDBM97735
Synonyms:US8481564, 12
TypeSmall organic molecule
Emp. Form.C22H22N8O
Mol. Mass.414.4631
SMILESO=C(Nc1ccc(cc1C1=CCCCC1)C1CNC(NC1)=NC#N)c1nc(c[nH]1)C#N