Reaction Details
TargetProto-oncogene tyrosine-protein kinase Src
LigandBDBM50221563
Substrate/Competitorn/a
Meas. Tech.Luciferase-Based Assay
Temperature298.15±n/a K
IC50 3.6±0.0 nM
Commentsextracted
Citation Gong, XBarrett, KCao, JGritzen, CNoronha, GHood, JDMak, CCMcPherson, APathak, VPRenick, JSoll, RMSplittgerber, UWrasidlo, WZeng, BZhao, NDneprovskaia, E Benzotriazine inhibitors of kinases US Patent US8481536 Publication Date 7/9/2013
 
Proto-oncogene tyrosine-protein kinase Src
Name:Proto-oncogene tyrosine-protein kinase Src
Type:Protein
Mol. Mass.:59838.60
Organism:Homo sapiens (Human)
Description:P12931
Residue:536
BDBM50221563
NameBDBM50221563
Synonyms:(4-(7-(2-chloro-5-hydroxyphenyl)-5-methylbenzo[e][1,2,4]triazin-3-ylamino)phenyl)(piperazin-1-yl)methanone CHEMBL250214 US8481536, 608
TypeSmall organic molecule
Emp. Form.C25H23ClN6O2
Mol. Mass.474.942
SMILESCc1cc(cc2nnc(Nc3ccc(cc3)C(=O)N3CCNCC3)nc12)-c1cc(O)ccc1Cl