Reaction Details
TargetProto-oncogene tyrosine-protein kinase Src
LigandBDBM50221557
Substrate/Competitorn/a
Meas. Tech.Luciferase-Based Assay
Temperature298.15±n/a K
IC50 2.9±0.0 nM
Commentsextracted
Citation Gong, XBarrett, KCao, JGritzen, CNoronha, GHood, JDMak, CCMcPherson, APathak, VPRenick, JSoll, RMSplittgerber, UWrasidlo, WZeng, BZhao, NDneprovskaia, E Benzotriazine inhibitors of kinases US Patent US8481536 Publication Date 7/9/2013
 
Proto-oncogene tyrosine-protein kinase Src
Name:Proto-oncogene tyrosine-protein kinase Src
Type:Protein
Mol. Mass.:59838.60
Organism:Homo sapiens (Human)
Description:P12931
Residue:536
BDBM50221557
NameBDBM50221557
Synonyms:(4-(7-(2-chloro-5-hydroxyphenyl)-5-methylbenzo[e][1,2,4]triazin-3-ylamino)phenyl)(4-methylpiperazin-1-yl)methanone US8481536, 504
TypeSmall organic molecule
Emp. Form.C26H25ClN6O2
Mol. Mass.488.969
SMILESCN1CCN(CC1)C(=O)c1ccc(Nc2nnc3cc(cc(C)c3n2)-c2cc(O)ccc2Cl)cc1