Reaction Details
TargetProto-oncogene tyrosine-protein kinase Src
LigandBDBM97963
Substrate/Competitorn/a
Meas. Tech.Luciferase-Based Assay
Temperature298.15±n/a K
IC50 3.7±0.0 nM
Commentsextracted
Citation Gong, XBarrett, KCao, JGritzen, CNoronha, GHood, JDMak, CCMcPherson, APathak, VPRenick, JSoll, RMSplittgerber, UWrasidlo, WZeng, BZhao, NDneprovskaia, E Benzotriazine inhibitors of kinases US Patent US8481536 Publication Date 7/9/2013
 
Proto-oncogene tyrosine-protein kinase Src
Name:Proto-oncogene tyrosine-protein kinase Src
Type:Protein
Mol. Mass.:59838.60
Organism:Homo sapiens (Human)
Description:P12931
Residue:536
BDBM97963
NameBDBM97963
Synonyms:US8481536, 552
TypeSmall organic molecule
Emp. Form.C27H29ClN6O3S
Mol. Mass.553.076
SMILESCN(CCN1CCCC1)S(=O)(=O)c1ccc(Nc2nnc3cc(c(C)cc3n2)-c2cc(O)ccc2Cl)cc1