Reaction Details
TargetTyrosine-protein kinase Yes
LigandBDBM50198782
Substrate/Competitorn/a
Meas. Tech.Luciferase-Based Assay
Temperature298.15±n/a K
IC50 10.3±0.0 nM
Commentsextracted
Citation Gong, XBarrett, KCao, JGritzen, CNoronha, GHood, JDMak, CCMcPherson, APathak, VPRenick, JSoll, RMSplittgerber, UWrasidlo, WZeng, BZhao, NDneprovskaia, E Benzotriazine inhibitors of kinases US Patent US8481536 Publication Date 7/9/2013
 
Tyrosine-protein kinase Yes
Name:Tyrosine-protein kinase Yes
Type:Protein
Mol. Mass.:60801.54
Organism:Homo sapiens (Human)
Description:P07947
Residue:543
BDBM50198782
NameBDBM50198782
Synonyms:([7-(2,6-dichloro-phenyl)-5-methyl-benzo[1,2,4]triazin-3-yl]-[4-(2-pyrrolidin-1-yl-ethoxy)-phenyl]-amine) 7-(2,6-dichlorophenyl)-5-methyl-N-[4-(2-pyrrolidin-1-ylethoxy)-phenyl]-1,2,4-benzotriazin-3-amine TG-100435 US8481536, 575
TypeSmall organic molecule
Emp. Form.C26H25Cl2N5O
Mol. Mass.494.416
SMILESCc1cc(cc2nnc(Nc3ccc(OCCN4CCCC4)cc3)nc12)-c1c(Cl)cccc1Cl