Reaction Details
TargetPlatelet-derived growth factor receptor beta
LigandBDBM50221566
Substrate/Competitorn/a
Meas. Tech.Luciferase-Based Assay
IC50 1.1±0.0 nM
Citation Gong, XBarrett, KCao, JGritzen, CNoronha, GHood, JDMak, CCMcPherson, APathak, VPRenick, JSoll, RMSplittgerber, UWrasidlo, WZeng, BZhao, NDneprovskaia, E Benzotriazine inhibitors of kinases US Patent US8481536 Publication Date 7/9/2013
 
Platelet-derived growth factor receptor beta
Name:Platelet-derived growth factor receptor beta
Type:Enzyme
Mol. Mass.:123922.25
Organism:Homo sapiens (Human)
Description:P09619
Residue:1106
BDBM50221566
NameBDBM50221566
Synonyms:4-chloro-3-(5-methyl-3-(4-(2-(pyrrolidin-1-yl)ethoxy)phenylamino)benzo[e][1,2,4]triazin-7-yl)phenol CHEMBL400402 US8481536, 597
TypeSmall organic molecule
Emp. Form.C26H26ClN5O2
Mol. Mass.475.97
SMILESCc1cc(cc2nnc(Nc3ccc(OCCN4CCCC4)cc3)nc12)-c1cc(O)ccc1Cl