Reaction Details
TargetPlatelet-derived growth factor receptor beta
LigandBDBM50221553
Substrate/Competitorn/a
Meas. Tech.Luciferase-Based Assay
IC50 1.7±0.0 nM
Citation Gong, XBarrett, KCao, JGritzen, CNoronha, GHood, JDMak, CCMcPherson, APathak, VPRenick, JSoll, RMSplittgerber, UWrasidlo, WZeng, BZhao, NDneprovskaia, E Benzotriazine inhibitors of kinases US Patent US8481536 Publication Date 7/9/2013
 
Platelet-derived growth factor receptor beta
Name:Platelet-derived growth factor receptor beta
Type:Enzyme
Mol. Mass.:123922.25
Organism:Homo sapiens (Human)
Description:P09619
Residue:1106
BDBM50221553
NameBDBM50221553
Synonyms:4-(7-(2-chloro-5-hydroxyphenyl)-5-methylbenzo[e][1,2,4]triazin-3-ylamino)-N-(2-(pyrrolidin-1-yl)ethyl)benzenesulfonamide CHEMBL249821 US8481536, 603
TypeSmall organic molecule
Emp. Form.C26H27ClN6O3S
Mol. Mass.539.049
SMILESCc1cc(cc2nnc(Nc3ccc(cc3)S(=O)(=O)NCCN3CCCC3)nc12)-c1cc(O)ccc1Cl