Reaction Details
TargetPlatelet-derived growth factor receptor beta
LigandBDBM50221556
Substrate/Competitorn/a
Meas. Tech.Luciferase-Based Assay
IC50 2.8±0.0 nM
Citation Gong, XBarrett, KCao, JGritzen, CNoronha, GHood, JDMak, CCMcPherson, APathak, VPRenick, JSoll, RMSplittgerber, UWrasidlo, WZeng, BZhao, NDneprovskaia, E Benzotriazine inhibitors of kinases US Patent US8481536 Publication Date 7/9/2013
 
Platelet-derived growth factor receptor beta
Name:Platelet-derived growth factor receptor beta
Type:Enzyme
Mol. Mass.:123922.25
Organism:Homo sapiens (Human)
Description:P09619
Residue:1106
BDBM50221556
NameBDBM50221556
Synonyms:4-chloro-3-(5-methyl-3-(4-(piperidin-4-ylsulfonyl)phenylamino)benzo[e][1,2,4]triazin-7-yl)phenol CHEMBL250625 US8481536, 617
TypeSmall organic molecule
Emp. Form.C25H24ClN5O3S
Mol. Mass.510.008
SMILESCc1cc(cc2nnc(Nc3ccc(cc3)S(=O)(=O)C3CCNCC3)nc12)-c1cc(O)ccc1Cl