Reaction Details
TargetEphrin type-B receptor 4
LigandBDBM50198782
Substrate/Competitorn/a
Meas. Tech.Luciferase-Based Assay
Temperature310.15±n/a K
IC50 40±0.0 nM
Commentsextracted
Citation Gong, XBarrett, KCao, JGritzen, CNoronha, GHood, JDMak, CCMcPherson, APathak, VPRenick, JSoll, RMSplittgerber, UWrasidlo, WZeng, BZhao, NDneprovskaia, E Benzotriazine inhibitors of kinases US Patent US8481536 Publication Date 7/9/2013
 
Ephrin type-B receptor 4
Name:Ephrin type-B receptor 4
Type:Enzyme
Mol. Mass.:108273.51
Organism:Homo sapiens (Human)
Description:P54760
Residue:987
BDBM50198782
NameBDBM50198782
Synonyms:([7-(2,6-dichloro-phenyl)-5-methyl-benzo[1,2,4]triazin-3-yl]-[4-(2-pyrrolidin-1-yl-ethoxy)-phenyl]-amine) 7-(2,6-dichlorophenyl)-5-methyl-N-[4-(2-pyrrolidin-1-ylethoxy)-phenyl]-1,2,4-benzotriazin-3-amine TG-100435 US8481536, 575
TypeSmall organic molecule
Emp. Form.C26H25Cl2N5O
Mol. Mass.494.416
SMILESCc1cc(cc2nnc(Nc3ccc(OCCN4CCCC4)cc3)nc12)-c1c(Cl)cccc1Cl