Reaction Details
TargetGenome polyprotein [1027-1711]
LigandBDBM98165
Substrate/Competitorn/a
Meas. Tech.Inhibition Assay
pH7.8±0
Ki 39±0.0 nM
IC50 202±0.0 nM
Citation Farmer, LJPerni, RBPitlik, Jvan Drie, Jr., JH Inhibitors of serine proteases, particularly HCV NS3-NS4A protease US Patent US8486989 Publication Date 7/16/2013
 
Genome polyprotein [1027-1711]
Name:Genome polyprotein [1027-1711]
Type:Protein
Mol. Mass.:73039.46
Organism:Hepatitis C virus (HCV)
Description:1027-1711 aa of P26664
Residue:685
BDBM98165
NameBDBM98165
Synonyms:US8486989, IA
TypeSmall organic molecule
Emp. Form.C38H53N7O6
Mol. Mass.703.8707
SMILESCCC[C@H](NC(=O)[C@@H]1[C@H]2[C@@H]3C[C@@H](C=C3)[C@H]2CN1C(=O)[C@@H](NC(=O)[C@@H](NC(=O)c1cnccn1)C1CCCCC1)C(C)(C)C)C(=O)C(=O)NC1CC1