Reaction Details
TargetTranslocator protein
LigandBDBM98171
Substrate/Competitorn/a
Meas. Tech.In Vitro Binding Assay
Ki 0.46±0.0 nM
Citation Kassiou, MJames, MLLuus, CA Translocator protein ligands US Patent US8492379 Publication Date 7/23/2013
 
Translocator protein
Name:Translocator protein
Type:Enzyme
Mol. Mass.:18834.74
Organism:Homo sapiens (Human)
Description:P30536
Residue:169
BDBM98171
NameBDBM98171
Synonyms:US8492379, 27
TypeSmall organic molecule
Emp. Form.C21H26N4O
Mol. Mass.350.4573
SMILESCCN(CC)C(=O)Cc1c(nc2c(C)cc(C)nn12)-c1ccc(C)cc1