Reaction Details
TargetTranslocator protein
LigandBDBM98178
Substrate/Competitorn/a
Meas. Tech.In Vitro Binding Assay
Ki 5.0±0.0 nM
Citation Kassiou, MJames, MLLuus, CA Translocator protein ligands US Patent US8492379 Publication Date 7/23/2013
 
Translocator protein
Name:Translocator protein
Type:Enzyme
Mol. Mass.:18834.74
Organism:Homo sapiens (Human)
Description:P30536
Residue:169
BDBM98178
NameBDBM98178
Synonyms:US8492379, 55
TypeSmall organic molecule
Emp. Form.C23H26N2O3
Mol. Mass.378.4641
SMILESCCN(CC)C(=O)C(Oc1ccccc1-n1cccc1)c1ccc(OC)cc1