Reaction Details
TargetActivated CDC42 kinase 1
LigandBDBM98282
Substrate/Competitorn/a
Meas. Tech.AlphaScreen Assay
IC50 118.8±n/a nM
Citation Crew, APJin, MKadalbajoo, MKleinberg, AMulvihill, MJWang, J Substituted imidazopyr- and imidazotri-azines US Patent US8481733 Publication Date 7/9/2013
 
Activated CDC42 kinase 1
Name:Activated CDC42 kinase 1
Type:Protein
Mol. Mass.:114577.86
Organism:Homo sapiens (Human)
Description:Q07912
Residue:1038
BDBM98282
NameBDBM98282
Synonyms:US8481733, 94
TypeSmall organic molecule
Emp. Form.C24H24N4O3
Mol. Mass.416.4724
SMILESCOc1cc(Oc2ccccc2)ccc1-c1nc([C@H]2C[C@@](C)(O)C2)n2ccnc(N)c12