Reaction Details
TargetcAMP and cAMP-inhibited cGMP 3',5'-cyclic phosphodiesterase 10A
LigandBDBM50398012
Substrate/Competitorn/a
Meas. Tech.Fluorescence Polarization Assay
Temperature298.15±n/a K
Ki 0.63±0.0 nM
Commentsextracted
Citation Breslin, MJColeman, PJCox, CDRaheem, ITSchreier, JD Alkoxy tetrahydro-pyridopyrimidine PDE10 inhibitors US Patent US8492392 Publication Date 7/23/2013
 
cAMP and cAMP-inhibited cGMP 3',5'-cyclic phosphodiesterase 10A
Name:cAMP and cAMP-inhibited cGMP 3',5'-cyclic phosphodiesterase 10A
Type:Protein
Mol. Mass.:88412.52
Organism:Homo sapiens (Human)
Description:Q9Y233
Residue:779
BDBM50398012
NameBDBM50398012
Synonyms:CHEMBL2180422 | US8492392, 1-17
TypeSmall organic molecule
Emp. Form.C20H20ClN5O3S
Mol. Mass.445.922
SMILESCC(C)Oc1nc(nc2CCN(Cc12)S(=O)(=O)c1cccnc1)-c1ccc(Cl)nc1