Reaction Details
TargetActivin receptor type-1B
LigandBDBM280338
Substrate/Competitorn/a
Meas. Tech.In Vitro Kinase Assay Inhibition of ALK1/2/3/4/5/6 Kinases
IC50 31.5±n/a nM
Citation Rai, RChakravarty, SPujala, BShinde, BUNayak, AKChaklan, NAgarwal, AKRamachandran, SAPham, SM Compounds and methods of use US Patent US10030004 Publication Date 7/24/2018
 
Activin receptor type-1B
Name:Activin receptor type-1B
Type:PROTEIN
Mol. Mass.:56810.99
Organism:Homo sapiens (Human)
Description:ChEMBL_587064
Residue:505
BDBM280338
NameBDBM280338
Synonyms:(S)-4-(2-(5-chloro-2-fluorophenyl)-5-(prop-1-en-2-yl)pyridin-4-ylamino)-N-(2-hydroxypropyl)pyridine-5-carboxamide US10501436, Compound 3a US11702401, Compound 3a
TypeSmall organic molecule
Emp. Form.C23H22ClFN4O2
Mol. Mass.440.898
SMILESC[C@H](O)CNC(=O)c1cnccc1Nc1cc(ncc1C(C)=C)-c1cc(Cl)ccc1F