Reaction Details
TargetActivin receptor type-1B
LigandBDBM280340
Substrate/Competitorn/a
Meas. Tech.In Vitro Kinase Assay Inhibition of ALK1/2/3/4/5/6 Kinases
IC50 8.60±n/a nM
Citation Rai, RChakravarty, SPujala, BShinde, BUNayak, AKChaklan, NAgarwal, AKRamachandran, SAPham, SM Compounds and methods of use US Patent US10030004 Publication Date 7/24/2018
 
Activin receptor type-1B
Name:Activin receptor type-1B
Type:PROTEIN
Mol. Mass.:56810.99
Organism:Homo sapiens (Human)
Description:ChEMBL_587064
Residue:505
BDBM280340
NameBDBM280340
Synonyms:(S)-4-(2-(5-chloro-2-fluorophenyl)-5-isopropylpyridin-4-ylamino)-N-(1-hydroxypropan-2-yl)nicotinamide US10501436, Compound 6a US11702401, Compound 6a
TypeSmall organic molecule
Emp. Form.C23H24ClFN4O2
Mol. Mass.442.914
SMILESCC(C)c1cnc(cc1Nc1ccncc1C(=O)N[C@@H](C)CO)-c1cc(Cl)ccc1F