Reaction Details
TargetTGF-beta receptor type-1
LigandBDBM280348
Substrate/Competitorn/a
Meas. Tech.In Vitro Kinase Assay Inhibition of ALK1/2/3/4/5/6 Kinases
IC50 15.5±n/a nM
Citation Rai, RChakravarty, SPujala, BShinde, BUNayak, AKChaklan, NAgarwal, AKRamachandran, SAPham, SM Compounds and methods of use US Patent US10030004 Publication Date 7/24/2018
 
TGF-beta receptor type-1
Name:TGF-beta receptor type-1
Type:enzyme
Mol. Mass.:55968.24
Organism:Homo sapiens (Human)
Description:P36897
Residue:503
BDBM280348
NameBDBM280348
Synonyms:N-(2-amino-2-oxo-ethyl)-4-[[2-(5-chloro-2-fluoro-phenyl)-5-isopropyl-4-pyridyl]amino]pyridine-3-carboxamide US10501436, Compound 15 US11702401, Compound 15
TypeSmall organic molecule
Emp. Form.C22H21ClFN5O2
Mol. Mass.441.886
SMILESCC(C)c1cnc(cc1Nc1ccncc1C(=O)NCC(N)=O)-c1cc(Cl)ccc1F