Reaction Details
TargetActivin receptor type-1B
LigandBDBM280356
Substrate/Competitorn/a
Meas. Tech.In Vitro Kinase Assay Inhibition of ALK1/2/3/4/5/6 Kinases
IC50 33.1±n/a nM
Citation Rai, RChakravarty, SPujala, BShinde, BUNayak, AKChaklan, NAgarwal, AKRamachandran, SAPham, SM Compounds and methods of use US Patent US10030004 Publication Date 7/24/2018
 
Activin receptor type-1B
Name:Activin receptor type-1B
Type:PROTEIN
Mol. Mass.:56810.99
Organism:Homo sapiens (Human)
Description:ChEMBL_587064
Residue:505
BDBM280356
NameBDBM280356
Synonyms:4-[[2-amino-6-(5-chloro-2-fluoro-phenyl)-3-isopropenyl-4-pyridyl]amino]-N-[(2S)-2-hydroxypropyl]pyridine-3-carboxamide US11053216, Compound 23a | US11702401, Compound 23a
TypeSmall organic molecule
Emp. Form.C26H26ClFN4O4
Mol. Mass.512.96
SMILESCOC(=O)c1cnccc1Nc1cc(nc(NC(=O)OC(C)(C)C)c1C(C)=C)-c1cc(Cl)ccc1F