Reaction Details
TargetActivin receptor type-1B
LigandBDBM280357
Substrate/Competitorn/a
Meas. Tech.In Vitro Kinase Assay Inhibition of ALK1/2/3/4/5/6 Kinases
IC50 230±n/a nM
Citation Rai, RChakravarty, SPujala, BShinde, BUNayak, AKChaklan, NAgarwal, AKRamachandran, SAPham, SM Compounds and methods of use US Patent US10030004 Publication Date 7/24/2018
 
Activin receptor type-1B
Name:Activin receptor type-1B
Type:PROTEIN
Mol. Mass.:56810.99
Organism:Homo sapiens (Human)
Description:ChEMBL_587064
Residue:505
BDBM280357
NameBDBM280357
Synonyms:4-[[2-(5-chloro-2-fluoro-phenyl)-5-isopropenyl-4-pyridyl]amino]-N-[(1S)-1-(hydroxymethyl)propyl]pyridine-3-carboxamide US10501436, Compound 24a US11702401, Compound 24a
TypeSmall organic molecule
Emp. Form.C24H24ClFN4O2
Mol. Mass.454.924
SMILESCC[C@@H](CO)NC(=O)c1cnccc1Nc1cc(ncc1C(C)=C)-c1cc(Cl)ccc1F