Reaction Details
TargetActivin receptor type-1B
LigandBDBM280362
Substrate/Competitorn/a
Meas. Tech.In Vitro Kinase Assay Inhibition of ALK1/2/3/4/5/6 Kinases
IC50 1100±n/a nM
Citation Rai, RChakravarty, SPujala, BShinde, BUNayak, AKChaklan, NAgarwal, AKRamachandran, SAPham, SM Compounds and methods of use US Patent US10030004 Publication Date 7/24/2018
 
Activin receptor type-1B
Name:Activin receptor type-1B
Type:PROTEIN
Mol. Mass.:56810.99
Organism:Homo sapiens (Human)
Description:ChEMBL_587064
Residue:505
BDBM280362
NameBDBM280362
Synonyms:N-[(2S)-2-hydroxypropyl]-4-{[2-phenyl-5-(propan-2-yl)pyridin-4-yl]amino} pyridine-3-carboxamide US11053216, Compound 28 | US11702401, Compound 28
TypeSmall organic molecule
Emp. Form.C23H26N4O2
Mol. Mass.390.4781
SMILESCC(O)CNC(=O)c1cnccc1Nc1cc(ncc1C(C)C)-c1ccccc1