Reaction Details
TargetTyrosine-protein kinase BTK
LigandBDBM97678
Substrate/Competitorn/a
Meas. Tech.Time-Resolved Fluorescence Resonance Energy Transfer Assay
pH7.4±0
IC50 0.58±0.0 nM
Citation Honigberg, LVerner, EPan, Z Inhibitors of Bruton's tyrosine kinase US Patent US8497277 Publication Date 7/30/2013
 
Tyrosine-protein kinase BTK
Name:Tyrosine-protein kinase BTK
Type:Enzyme
Mol. Mass.:76289.95
Organism:Homo sapiens (Human)
Description:Q06187
Residue:659
BDBM97678
NameBDBM97678
Synonyms:US8476284, 9 US8497277, 9 US9181263, 6 | US9278100, 6
TypeSmall organic molecule
Emp. Form.C25H24N6O2
Mol. Mass.440.4971
SMILESNc1ncnc2n(nc(-c3ccc(Oc4ccccc4)cc3)c12)C1CCN(CC1)C(=O)C=C