Reaction Details
TargetGag-Pol polyprotein
LigandBDBM98669
Substrate/Competitorn/a
Meas. Tech.Inhibition Assay
IC50 3.6e+2±n/a nM
Citation Thuring, JWBonfanti, JFortin, JM Macrocyclic integrase inhibitors US Patent US8497270 Publication Date 7/30/2013
 
Gag-Pol polyprotein
Name:Gag-Pol polyprotein
Type:Protein
Mol. Mass.:163312.58
Organism:Human immunodeficiency virus type 1 (HIV-1)
Description:P03367
Residue:1447
BDBM98669
NameBDBM98669
Synonyms:US8497270, 30
TypeSmall organic molecule
Emp. Form.C5H14N2O2S
Mol. Mass.166.242
SMILESCNS(=O)(=O)CCCCN