Reaction Details
TargetBeta-lactamase
LigandBDBM98854
Substrate/CompetitorBDBM98856
Meas. Tech.Spectrophotometric Assay
IC50 6±0.0 nM
Citation Blizzard, TAChen, HGude, CHermes, JDImbriglio, JKim, SWu, JYMortko, CJMangion, IRivera, NRuck, RTShevlin, M Beta-lactamase inhibitors US Patent US8487093 Publication Date 7/16/2013
 
Beta-lactamase
Name:Beta-lactamase
Synonyms:Beta-lactamase (AmpC)
Type:Enzyme
Mol. Mass.:43489.98
Organism:Pseudomonas aeruginosa
Description:Q3LG62
Residue:397
BDBM98854
BDBM98856
NameBDBM98854
Synonyms:US8487093, 17
TypeSmall organic molecule
Emp. Form.C17H23N5O6S
Mol. Mass.425.459
SMILESOS(=O)(=O)ON1C2CN([C@@H](CC2)C(=O)Nc2ccc(cn2)C2CCNCC2)C1=O